Auteur : thekingyas
Posté le 25 novembre 2015
Télécharger | Reposter | Largeur fixe

Log de la console

>BOOTING UP GRADLE...
>Data loaded, MCreator gradle console ready [ver 1.007]! [boot took 262 milliseconds]
>RIGHT click once to copy log to the clipboard or twice to clear the log.
>=========================================================================================================================
>Executing gradle command: cleanCache clean setupDecompWorkspace --refresh-dependencies
>Microsoft Windows [version 10.0.10240]
>(c) 2015 Microsoft Corporation. Tous droits r‚serv‚s.
>C:\Pylo\MCreator159>cd forge
>C:\Pylo\MCreator159\forge>SET "JAVA_HOME=C:\Pylo\MCreator159\jdk\"
>C:\Pylo\MCreator159\forge>SET JAVA_EXE=%JAVA_HOME%\bin\java.exe
>C:\Pylo\MCreator159\forge>SET PATH=%JAVA_HOME%\bin\;%PATH%
>C:\Pylo\MCreator159\forge>gradlew cleanCache clean setupDecompWorkspace --refresh-dependencies
>****************************
> Powered By MCP:
> http://modcoderpack.com/
> Searge, ProfMobius, Fesh0r,
> R4wk, ZeuX, IngisKahn, bspkrs
> MCP Data version : unknown
>****************************
>:cleanCache
>:clean
>:extractMcpData
>:getVersionJson
>:extractUserDev
>FAILURE: Build failed with an exception.
>* What went wrong:
>Could not resolve all dependencies for configuration ':userDevPackageDepConfig'.
>> Could not resolve net.minecraftforge:forge:1.7.10-10.13.4.1448-1.7.10.
> Required by:
> com.yourname.modid:forge:1.0
> > Could not GET 'http://files.minecraftforge.net/maven/net/minecraftforge/forge/1.7.10-10.13.4.1448-1.7.10/forge-1.7.10-10.13.4.1448-1.7.10.pom'.
> > Connection to http://files.minecraftforge.net refused
> > Could not GET 'https://libraries.minecraft.net/net/minecraftforge/forge/1.7.10-10.13.4.1448-1.7.10/forge-1.7.10-10.13.4.1448-1.7.10.pom'. Received status code 403 from server: Forbidden
>* Try:
>Run with --stacktrace option to get the stack trace. Run with --info or --debug option to get more log output.
>BUILD FAILED
>Total time: 1 mins 10.268 secs
>C:\Pylo\MCreator159\forge>
>Task completed with return code 0 in 73243 milliseconds
>Task return code check OK!
>=========================================================================================================================
>Executing gradle command: build
>Microsoft Windows [version 10.0.10240]
>(c) 2015 Microsoft Corporation. Tous droits r‚serv‚s.
>C:\Pylo\MCreator159>cd forge
>C:\Pylo\MCreator159\forge>SET "JAVA_HOME=C:\Pylo\MCreator159\jdk\"
>C:\Pylo\MCreator159\forge>SET JAVA_EXE=%JAVA_HOME%\bin\java.exe
>C:\Pylo\MCreator159\forge>SET PATH=%JAVA_HOME%\bin\;%PATH%
>C:\Pylo\MCreator159\forge>gradlew build
>****************************
> Powered By MCP:
> http://modcoderpack.com/
> Searge, ProfMobius, Fesh0r,
> R4wk, ZeuX, IngisKahn, bspkrs
> MCP Data version : unknown
>****************************
>=========================================================================================================================
>Executing gradle command: build
>Microsoft Windows [version 10.0.10240]
>(c) 2015 Microsoft Corporation. Tous droits r‚serv‚s.
>C:\Pylo\MCreator159>cd forge
>C:\Pylo\MCreator159\forge>SET "JAVA_HOME=C:\Pylo\MCreator159\jdk\"
>C:\Pylo\MCreator159\forge>SET JAVA_EXE=%JAVA_HOME%\bin\java.exe
>C:\Pylo\MCreator159\forge>SET PATH=%JAVA_HOME%\bin\;%PATH%
>C:\Pylo\MCreator159\forge>gradlew build
>****************************
> Powered By MCP:
> http://modcoderpack.com/
> Searge, ProfMobius, Fesh0r,
> R4wk, ZeuX, IngisKahn, bspkrs
> MCP Data version : unknown
>****************************
>java.util.zip.ZipException: invalid entry size (expected 16472 but got 2832066 bytes)
>         at java.util.zip.ZipInputStream.readEnd(ZipInputStream.java:403)
>         at java.util.zip.ZipInputStream.read(ZipInputStream.java:195)
>         at java.io.FilterInputStream.read(FilterInputStream.java:107)
>         at com.google.common.io.ByteStreams.copy(ByteStreams.java:70)
>         at com.google.common.io.ByteStreams.toByteArray(ByteStreams.java:115)
>         at net.minecraftforge.gradle.common.Constants.hashZip(Constants.java:196)
>         at net.minecraftforge.gradle.common.Constants.hash(Constants.java:146)
>         at net.minecraftforge.gradle.common.Constants.hashAll(Constants.java:161)
>         at net.minecraftforge.gradle.tasks.abstractutil.CachedTask.getHashes(CachedTask.java:204)
>         at net.minecraftforge.gradle.tasks.abstractutil.CachedTask.access$500(CachedTask.java:41)
>         at net.minecraftforge.gradle.tasks.abstractutil.CachedTask$2.execute(CachedTask.java:179)
>         at net.minecraftforge.gradle.tasks.abstractutil.CachedTask$2.execute(CachedTask.java:166)
>         at org.gradle.api.internal.AbstractTask$TaskActionWrapper.execute(AbstractTask.java:570)
>         at org.gradle.api.internal.AbstractTask$TaskActionWrapper.execute(AbstractTask.java:553)
>         at org.gradle.api.internal.tasks.execution.ExecuteActionsTaskExecuter.executeAction(ExecuteActionsTaskExecuter.java:80)
>         at org.gradle.api.internal.tasks.execution.ExecuteActionsTaskExecuter.executeActions(ExecuteActionsTaskExecuter.java:61)
>         at org.gradle.api.internal.tasks.execution.ExecuteActionsTaskExecuter.execute(ExecuteActionsTaskExecuter.java:46)
>         at org.gradle.api.internal.tasks.execution.PostExecutionAnalysisTaskExecuter.execute(PostExecutionAnalysisTaskExecuter.java:35)
>         at org.gradle.api.internal.tasks.execution.SkipUpToDateTaskExecuter.execute(SkipUpToDateTaskExecuter.java:64)
>         at org.gradle.api.internal.tasks.execution.ValidatingTaskExecuter.execute(ValidatingTaskExecuter.java:58)
>         at org.gradle.api.internal.tasks.execution.SkipEmptySourceFilesTaskExecuter.execute(SkipEmptySourceFilesTaskExecuter.java:42)
>         at org.gradle.api.internal.tasks.execution.SkipTaskWithNoActionsExecuter.execute(SkipTaskWithNoActionsExecuter.java:52)
>         at org.gradle.api.internal.tasks.execution.SkipOnlyIfTaskExecuter.execute(SkipOnlyIfTaskExecuter.java:53)
>         at org.gradle.api.internal.tasks.execution.ExecuteAtMostOnceTaskExecuter.execute(ExecuteAtMostOnceTaskExecuter.java:43)
>         at org.gradle.api.internal.AbstractTask.executeWithoutThrowingTaskFailure(AbstractTask.java:296)
>         at org.gradle.execution.taskgraph.AbstractTaskPlanExecutor$TaskExecutorWorker.executeTask(AbstractTaskPlanExecutor.java:79)
>         at org.gradle.execution.taskgraph.AbstractTaskPlanExecutor$TaskExecutorWorker.processTask(AbstractTaskPlanExecutor.java:63)
>         at org.gradle.execution.taskgraph.AbstractTaskPlanExecutor$TaskExecutorWorker.run(AbstractTaskPlanExecutor.java:51)
>         at org.gradle.execution.taskgraph.DefaultTaskPlanExecutor.process(DefaultTaskPlanExecutor.java:23)
>         at org.gradle.execution.taskgraph.DefaultTaskGraphExecuter.execute(DefaultTaskGraphExecuter.java:86)
>         at org.gradle.execution.SelectedTaskExecutionAction.execute(SelectedTaskExecutionAction.java:29)
>         at org.gradle.execution.DefaultBuildExecuter.execute(DefaultBuildExecuter.java:61)
>         at org.gradle.execution.DefaultBuildExecuter.access$200(DefaultBuildExecuter.java:23)
>         at org.gradle.execution.DefaultBuildExecuter$2.proceed(DefaultBuildExecuter.java:67)
>         at org.gradle.execution.DryRunBuildExecutionAction.execute(DryRunBuildExecutionAction.java:32)
>         at org.gradle.execution.DefaultBuildExecuter.execute(DefaultBuildExecuter.java:61)
>         at org.gradle.execution.DefaultBuildExecuter.execute(DefaultBuildExecuter.java:54)
>         at org.gradle.initialization.DefaultGradleLauncher.doBuildStages(DefaultGradleLauncher.java:148)
>         at org.gradle.initialization.DefaultGradleLauncher.doBuild(DefaultGradleLauncher.java:105)
>         at org.gradle.initialization.DefaultGradleLauncher.run(DefaultGradleLauncher.java:85)
>         at org.gradle.launcher.exec.InProcessBuildActionExecuter$DefaultBuildController.run(InProcessBuildActionExecuter.java:81)
>         at org.gradle.launcher.cli.ExecuteBuildAction.run(ExecuteBuildAction.java:33)
>         at org.gradle.launcher.cli.ExecuteBuildAction.run(ExecuteBuildAction.java:24)
>         at org.gradle.launcher.exec.InProcessBuildActionExecuter.execute(InProcessBuildActionExecuter.java:39)
>         at org.gradle.launcher.exec.InProcessBuildActionExecuter.execute(InProcessBuildActionExecuter.java:29)
>         at org.gradle.launcher.cli.RunBuildAction.run(RunBuildAction.java:50)
>         at org.gradle.internal.Actions$RunnableActionAdapter.execute(Actions.java:171)
>         at org.gradle.launcher.cli.CommandLineActionFactory$ParseAndBuildAction.execute(CommandLineActionFactory.java:237)
>         at org.gradle.launcher.cli.CommandLineActionFactory$ParseAndBuildAction.execute(CommandLineActionFactory.java:210)
>         at org.gradle.launcher.cli.JavaRuntimeValidationAction.execute(JavaRuntimeValidationAction.java:35)
>         at org.gradle.launcher.cli.JavaRuntimeValidationAction.execute(JavaRuntimeValidationAction.java:24)
>         at org.gradle.launcher.cli.CommandLineActionFactory$WithLogging.execute(CommandLineActionFactory.java:206)
>         at org.gradle.launcher.cli.CommandLineActionFactory$WithLogging.execute(CommandLineActionFactory.java:169)
>         at org.gradle.launcher.cli.ExceptionReportingAction.execute(ExceptionReportingAction.java:33)
>         at org.gradle.launcher.cli.ExceptionReportingAction.execute(ExceptionReportingAction.java:22)
>         at org.gradle.launcher.Main.doAction(Main.java:33)
>         at org.gradle.launcher.bootstrap.EntryPoint.run(EntryPoint.java:45)
>         at sun.reflect.NativeMethodAccessorImpl.invoke0(Native Method)
>         at sun.reflect.NativeMethodAccessorImpl.invoke(NativeMethodAccessorImpl.java:57)
>         at sun.reflect.DelegatingMethodAccessorImpl.invoke(DelegatingMethodAccessorImpl.java:43)
>         at java.lang.reflect.Method.invoke(Method.java:606)
>         at org.gradle.launcher.bootstrap.ProcessBootstrap.runNoExit(ProcessBootstrap.java:54)
>         at org.gradle.launcher.bootstrap.ProcessBootstrap.run(ProcessBootstrap.java:35)
>         at org.gradle.launcher.GradleMain.main(GradleMain.java:23)
>         at sun.reflect.NativeMethodAccessorImpl.invoke0(Native Method)
>         at sun.reflect.NativeMethodAccessorImpl.invoke(NativeMethodAccessorImpl.java:57)
>         at sun.reflect.DelegatingMethodAccessorImpl.invoke(DelegatingMethodAccessorImpl.java:43)
>         at java.lang.reflect.Method.invoke(Method.java:606)
>         at org.gradle.wrapper.BootstrapMainStarter.start(BootstrapMainStarter.java:30)
>         at org.gradle.wrapper.WrapperExecutor.execute(WrapperExecutor.java:127)
>         at org.gradle.wrapper.GradleWrapperMain.main(GradleWrapperMain.java:56)
>java.lang.NullPointerException
>         at com.google.common.base.Preconditions.checkNotNull(Preconditions.java:210)
>         at com.google.common.base.Joiner.toString(Joiner.java:433)
>         at com.google.common.base.Joiner.appendTo(Joiner.java:108)
>         at com.google.common.base.Joiner.appendTo(Joiner.java:152)
>         at com.google.common.base.Joiner.join(Joiner.java:193)
>         at com.google.common.base.Joiner.join(Joiner.java:183)
>         at net.minecraftforge.gradle.tasks.abstractutil.CachedTask.getHashes(CachedTask.java:275)
>         at net.minecraftforge.gradle.tasks.abstractutil.CachedTask.access$500(CachedTask.java:41)
>         at net.minecraftforge.gradle.tasks.abstractutil.CachedTask$2.execute(CachedTask.java:179)
>         at net.minecraftforge.gradle.tasks.abstractutil.CachedTask$2.execute(CachedTask.java:166)
>         at org.gradle.api.internal.AbstractTask$TaskActionWrapper.execute(AbstractTask.java:570)
>         at org.gradle.api.internal.AbstractTask$TaskActionWrapper.execute(AbstractTask.java:553)
>         at org.gradle.api.internal.tasks.execution.ExecuteActionsTaskExecuter.executeAction(ExecuteActionsTaskExecuter.java:80)
>         at org.gradle.api.internal.tasks.execution.ExecuteActionsTaskExecuter.executeActions(ExecuteActionsTaskExecuter.java:61)
>         at org.gradle.api.internal.tasks.execution.ExecuteActionsTaskExecuter.execute(ExecuteActionsTaskExecuter.java:46)
>         at org.gradle.api.internal.tasks.execution.PostExecutionAnalysisTaskExecuter.execute(PostExecutionAnalysisTaskExecuter.java:35)
>         at org.gradle.api.internal.tasks.execution.SkipUpToDateTaskExecuter.execute(SkipUpToDateTaskExecuter.java:64)
>         at org.gradle.api.internal.tasks.execution.ValidatingTaskExecuter.execute(ValidatingTaskExecuter.java:58)
>         at org.gradle.api.internal.tasks.execution.SkipEmptySourceFilesTaskExecuter.execute(SkipEmptySourceFilesTaskExecuter.java:42)
>         at org.gradle.api.internal.tasks.execution.SkipTaskWithNoActionsExecuter.execute(SkipTaskWithNoActionsExecuter.java:52)
>         at org.gradle.api.internal.tasks.execution.SkipOnlyIfTaskExecuter.execute(SkipOnlyIfTaskExecuter.java:53)
>         at org.gradle.api.internal.tasks.execution.ExecuteAtMostOnceTaskExecuter.execute(ExecuteAtMostOnceTaskExecuter.java:43)
>         at org.gradle.api.internal.AbstractTask.executeWithoutThrowingTaskFailure(AbstractTask.java:296)
>         at org.gradle.execution.taskgraph.AbstractTaskPlanExecutor$TaskExecutorWorker.executeTask(AbstractTaskPlanExecutor.java:79)
>         at org.gradle.execution.taskgraph.AbstractTaskPlanExecutor$TaskExecutorWorker.processTask(AbstractTaskPlanExecutor.java:63)
>         at org.gradle.execution.taskgraph.AbstractTaskPlanExecutor$TaskExecutorWorker.run(AbstractTaskPlanExecutor.java:51)
>         at org.gradle.execution.taskgraph.DefaultTaskPlanExecutor.process(DefaultTaskPlanExecutor.java:23)
>         at org.gradle.execution.taskgraph.DefaultTaskGraphExecuter.execute(DefaultTaskGraphExecuter.java:86)
>         at org.gradle.execution.SelectedTaskExecutionAction.execute(SelectedTaskExecutionAction.java:29)
>         at org.gradle.execution.DefaultBuildExecuter.execute(DefaultBuildExecuter.java:61)
>         at org.gradle.execution.DefaultBuildExecuter.access$200(DefaultBuildExecuter.java:23)
>         at org.gradle.execution.DefaultBuildExecuter$2.proceed(DefaultBuildExecuter.java:67)
>         at org.gradle.execution.DryRunBuildExecutionAction.execute(DryRunBuildExecutionAction.java:32)
>         at org.gradle.execution.DefaultBuildExecuter.execute(DefaultBuildExecuter.java:61)
>         at org.gradle.execution.DefaultBuildExecuter.execute(DefaultBuildExecuter.java:54)
>         at org.gradle.initialization.DefaultGradleLauncher.doBuildStages(DefaultGradleLauncher.java:148)
>         at org.gradle.initialization.DefaultGradleLauncher.doBuild(DefaultGradleLauncher.java:105)
>         at org.gradle.initialization.DefaultGradleLauncher.run(DefaultGradleLauncher.java:85)
>         at org.gradle.launcher.exec.InProcessBuildActionExecuter$DefaultBuildController.run(InProcessBuildActionExecuter.java:81)
>         at org.gradle.launcher.cli.ExecuteBuildAction.run(ExecuteBuildAction.java:33)
>         at org.gradle.launcher.cli.ExecuteBuildAction.run(ExecuteBuildAction.java:24)
>         at org.gradle.launcher.exec.InProcessBuildActionExecuter.execute(InProcessBuildActionExecuter.java:39)
>         at org.gradle.launcher.exec.InProcessBuildActionExecuter.execute(InProcessBuildActionExecuter.java:29)
>         at org.gradle.launcher.cli.RunBuildAction.run(RunBuildAction.java:50)
>         at org.gradle.internal.Actions$RunnableActionAdapter.execute(Actions.java:171)
>         at org.gradle.launcher.cli.CommandLineActionFactory$ParseAndBuildAction.execute(CommandLineActionFactory.java:237)
>         at org.gradle.launcher.cli.CommandLineActionFactory$ParseAndBuildAction.execute(CommandLineActionFactory.java:210)
>         at org.gradle.launcher.cli.JavaRuntimeValidationAction.execute(JavaRuntimeValidationAction.java:35)
>         at org.gradle.launcher.cli.JavaRuntimeValidationAction.execute(JavaRuntimeValidationAction.java:24)
>         at org.gradle.launcher.cli.CommandLineActionFactory$WithLogging.execute(CommandLineActionFactory.java:206)
>         at org.gradle.launcher.cli.CommandLineActionFactory$WithLogging.execute(CommandLineActionFactory.java:169)
>         at org.gradle.launcher.cli.ExceptionReportingAction.execute(ExceptionReportingAction.java:33)
>         at org.gradle.launcher.cli.ExceptionReportingAction.execute(ExceptionReportingAction.java:22)
>         at org.gradle.launcher.Main.doAction(Main.java:33)
>         at org.gradle.launcher.bootstrap.EntryPoint.run(EntryPoint.java:45)
>         at sun.reflect.NativeMethodAccessorImpl.invoke0(Native Method)
>         at sun.reflect.NativeMethodAccessorImpl.invoke(NativeMethodAccessorImpl.java:57)
>         at sun.reflect.DelegatingMethodAccessorImpl.invoke(DelegatingMethodAccessorImpl.java:43)
>         at java.lang.reflect.Method.invoke(Method.java:606)
>         at org.gradle.launcher.bootstrap.ProcessBootstrap.runNoExit(ProcessBootstrap.java:54)
>         at org.gradle.launcher.bootstrap.ProcessBootstrap.run(ProcessBootstrap.java:35)
>         at org.gradle.launcher.GradleMain.main(GradleMain.java:23)
>         at sun.reflect.NativeMethodAccessorImpl.invoke0(Native Method)
>         at sun.reflect.NativeMethodAccessorImpl.invoke(NativeMethodAccessorImpl.java:57)
>         at sun.reflect.DelegatingMethodAccessorImpl.invoke(DelegatingMethodAccessorImpl.java:43)
>         at java.lang.reflect.Method.invoke(Method.java:606)
>         at org.gradle.wrapper.BootstrapMainStarter.start(BootstrapMainStarter.java:30)
>         at org.gradle.wrapper.WrapperExecutor.execute(WrapperExecutor.java:127)
>         at org.gradle.wrapper.GradleWrapperMain.main(GradleWrapperMain.java:56)
>:downloadClient
>:downloadClient
>:downloadServer
>:getVersionJson
>:extractUserDev
>:mergeJars
>:downloadServer
>:getVersionJson
>:extractUserDev UP-TO-DATE
>:mergeJars SKIPPED
>:applyBinPatches
>:downloadMcpTools
>:extractMcpData UP-TO-DATE
>:genSrgs
>:deobfBinJar
>Applying SpecialSource...
>:deobfBinJar FAILED
>FAILURE: Build failed with an exception.
>* What went wrong:
>Execution failed for task ':deobfBinJar'.
>> java.lang.NullPointerException (no error message)
>* Try:
>Run with --stacktrace option to get the stack trace. Run with --info or --debug option to get more log output.
>BUILD FAILED
>Total time: 4 mins 25.302 secs
>C:\Pylo\MCreator159\forge>
>:applyBinPatches
>:downloadMcpTools SKIPPED
>:extractMcpData UP-TO-DATE
>:genSrgs SKIPPED
>:deobfBinJar
>Applying SpecialSource...
>Applying Exceptor...
>Stripping synthetics...
>:compileApiJava UP-TO-DATE
>:processApiResources UP-TO-DATE
>:apiClasses UP-TO-DATE
>:sourceMainJava
>C:\Pylo\MCreator159\forge\build\sources\java\mod\mcreator\ChannelHandlerLoite.java:83: error: package org.apache.logging.log4j does not exist
>import org.apache.logging.log4j.LogManager;
> ^
>C:\Pylo\MCreator159\forge\build\sources\java\mod\mcreator\ChannelHandlerLoite.java:84: error: package org.apache.logging.log4j does not exist
>import org.apache.logging.log4j.Logger;
> ^
>C:\Pylo\MCreator159\forge\build\sources\java\mod\mcreator\ChannelHandlerLoite.java:89: error: package io.netty.buffer does not exist
>import io.netty.buffer.ByteBuf;
> ^
>C:\Pylo\MCreator159\forge\build\sources\java\mod\mcreator\ChannelHandlerLoite.java:90: error: package io.netty.channel does not exist
>import io.netty.channel.ChannelHandlerContext;
> ^
>C:\Pylo\MCreator159\forge\build\sources\java\mod\mcreator\ChannelHandlerLoite.java:92: error: cannot access MessageToMessageCodec
>public class ChannelHandlerLoite extends FMLIndexedMessageToMessageCodec<IPacketLoite> {
> ^
> class file for io.netty.handler.codec.MessageToMessageCodec not found
>C:\Pylo\MCreator159\forge\build\sources\java\mod\mcreator\ChannelHandlerLoite.java:95: error: cannot find symbol
>         public void encodeInto(ChannelHandlerContext ctx, IPacketLoite packet, ByteBuf data) throws Exception {
>          ^
> symbol: class ChannelHandlerContext
> location: class ChannelHandlerLoite
>C:\Pylo\MCreator159\forge\build\sources\java\mod\mcreator\ChannelHandlerLoite.java:95: error: cannot find symbol
>         public void encodeInto(ChannelHandlerContext ctx, IPacketLoite packet, ByteBuf data) throws Exception {
>          ^
> symbol: class ByteBuf
> location: class ChannelHandlerLoite
>C:\Pylo\MCreator159\forge\build\sources\java\mod\mcreator\ChannelHandlerLoite.java:100: error: cannot find symbol
>         public void decodeInto(ChannelHandlerContext ctx, ByteBuf data, IPacketLoite packet) {
>          ^
> symbol: class ChannelHandlerContext
> location: class ChannelHandlerLoite
>C:\Pylo\MCreator159\forge\build\sources\java\mod\mcreator\ChannelHandlerLoite.java:100: error: cannot find symbol
>         public void decodeInto(ChannelHandlerContext ctx, ByteBuf data, IPacketLoite packet) {
>          ^
> symbol: class ByteBuf
> location: class ChannelHandlerLoite
>C:\Pylo\MCreator159\forge\build\sources\java\mod\mcreator\IPacketLoite.java:10: error: cannot find symbol
>         public void readBytes(ByteBuf bytes);
>          ^
> symbol: class ByteBuf
> location: interface IPacketLoite
>C:\Pylo\MCreator159\forge\build\sources\java\mod\mcreator\IPacketLoite.java:11: error: cannot find symbol
>         public void writeBytes(ByteBuf bytes);
>          ^
> symbol: class ByteBuf
> location: interface IPacketLoite

x
Éditer le texte

Merci d'entrer le mot de passe que vous avez indiqué à la création du texte.

x
Télécharger le texte

Merci de choisir le format du fichier à télécharger.